Home > Error Code > Win32 Error Code 1727

Win32 Error Code 1727


ERROR_ADAP_HDW_ERR 58 The specified server cannot perform the requested operation. Art Bunch posted Jul 9, 2016 Microsoft.net framework install... The command ..symfix+ adds the URL for the Microsoft public symbol server if is not on the path. I just don't get it!Event Category: NoneEvent ID: 6161Date: 2/15/2006Time: 9:03:58 AMUser: xxxxxxxxxComputer: DCPRINTSRV01Description:The document ASP Task Sheet(1).xls owned by xxxxx failed to print on printer HP DJ 5850 Sales 01. http://pubdimensions.com/error-code/windows-error-code-1727.php

ERROR_VOLSNAP_HIBERNATE_READY 762 A file system or file system filter driver has successfully completed an FsFilter operation. ERROR_DYNLINK_FROM_INVALID_RING 197 The operating system is not presently configured to run this application. Facebook Twitter Google+ YouTube LinkedIn Tumblr Pinterest Newsletters RSS Our website uses cookies Cookies help us deliver our services. By using our websites, you agree to our use of cookies. find this

Error 1801 The Printer Name Is Invalid

ERROR_UNEXPECTED_MM_MAP_ERROR 558 If an MM error is returned which is not defined in the standard FsRtl filter, it is converted to one of the following errors which is guaranteed to be ERROR_BOOT_ALREADY_ACCEPTED 1077 No attempts to start the service have been made since the last boot. The system has been shut down. The problem happened to me today logged in as an administrator account.

ERROR_JOIN_TO_SUBST 141 The system tried to SUBST a drive to a directory on a joined drive. ERROR_SERVICE_NOT_IN_EXE 1084 This service cannot be started in Safe Mode. ERROR_ACCESS_DENIED 6 The handle is invalid. Wnetaddconnection2 Error Codes ERROR_IO_PRIVILEGE_FAILED 572 {Application Exit by CTRL+C} The application terminated as a result of a CTRL+C.

ERROR_REDIR_PAUSED 80 The file exists. System Error 1909 The Referenced Account Is Currently Locked Out ERROR_PRINT_CANCELLED 64 The specified network name is no longer available. ERROR_PNP_TRANSLATION_FAILED 673 A IRQ translator failed to translate resources. Use your global user account or local user account to access this server. ERROR_DOMAIN_TRUST_INCONSISTENT 1810 (0x712) The name or security ID (SID) of the domain specified is inconsistent with the

ERROR_INVALID_ACCESS 13 The data is invalid. Error 1909 Authenticating User ERROR_FILE_CHECKED_OUT 221 The file must be checked out before saving changes. ERROR_THREAD_NOT_IN_PROCESS 567 Page file quota was exceeded. ERROR_GRACEFUL_DISCONNECT 1227 The network transport endpoint already has an address associated with it.

System Error 1909 The Referenced Account Is Currently Locked Out

ERROR_NOACCESS 999 Error performing inpage operation. http://www.winvistatips.com/threads/printer-spooler-keeps-crashing-windows-server-2003-sp2-r2.576270/ Insert %2 (Volume Serial Number: %3) into drive %1. Error 1801 The Printer Name Is Invalid ERROR_TOO_MANY_SEM_REQUESTS 104 Cannot request exclusive semaphores at interrupt time. Cluster Api Call Failed With Error Code 0x800706d9 ERROR_NO_TOKEN 1009 The configuration registry database is corrupt.

ERROR_NOT_ENOUGH_SERVER_MEMORY 1131 A potential deadlock condition has been detected. Check This Out ERROR_INSUFFICIENT_BUFFER 123 The filename, directory name, or volume label syntax is incorrect. Should problems occur with this system, contact the CPU manufacturer to see if this mix of processors is supported. Of course, I also need to make sure that ntsd can find the symbols for my application. Windows Error 1909

ERROR_BADSTARTPOSITION 779 The hardware has reported an uncorrectable memory error. ERROR_GUID_SUBSTITUTION_MADE 681 The create operation stopped after reaching a symbolic link ERROR_STOPPED_ON_SYMLINK 682 A long jump has been executed. ERROR_BAD_NET_RESP 59 An unexpected network error occurred. Source ERROR_NO_ASSOCIATION 1156 An error occurred in sending the command to the application.

ERROR_NETWORK_BUSY 55 The specified network resource or device is no longer available. Error_resource_type_not_found ERROR_TOO_MANY_TCBS 156 The recipient process has refused the signal. ERROR_PARTITION_FAILURE 1106 When accessing a new tape of a multivolume partition, the current block size is incorrect.

ERROR_INVALID_ADDRESS 500 User profile cannot be loaded.

ERROR_KEY_DELETED 1019 System could not allocate the required space in a registry log. ERROR_SERVICE_ALREADY_RUNNING 1057 The account name is invalid or does not exist, or the password is invalid for the account name specified. Following frames may be wrong. 02c5fe90 77c68ad6 rpcrt4!I_RpcTransConnectionAllocatePacket+0x1e4 02c5fea4 77c6e8db rpcrt4!I_RpcTransGetThreadEvent+0x1b4 02c5ff04 77c6e7b4 rpcrt4!I_RpcLogEvent+0x59c 02c5ff18 77c7b799 rpcrt4!I_RpcLogEvent+0x475 02c5ff84 77c7b9b5 rpcrt4!NdrFullPointerInsertRefId+0xa43 02c5ff8c 77c8872d rpcrt4!NdrFullPointerInsertRefId+0xc5f 02c5ffac 77c7b110 rpcrt4!I_RpcFree+0xb6b *** ERROR: Symbol file could Error_invalid_user_buffer ERROR_EXE_MARKED_INVALID 193 %1 is not a valid Win32 application.

ERROR_ADDRESS_ALREADY_ASSOCIATED 1228 An address has not yet been associated with the network endpoint. ERROR_NO_VOLUME_LABEL 126 The specified module could not be found. ERROR_DISK_REPAIR_DISABLED 781 The Desktop heap encountered an error while allocating session memory. have a peek here ERROR_CANNOT_MAKE 83 Fail on INT 24.

ERROR_INVALID_FLAGS 1005 The volume does not contain a recognized file system. ERROR_DISK_RESET_FAILED 1129 Physical end of tape encountered. Total number of pages in the document: 1. ERROR_SEGMENT_NOTIFICATION 703 {Invalid Current Directory} The process cannot switch to the startup current directory %hs.

ERROR_NESTING_NOT_ALLOWED 216 The image file %1 is valid, but is for a machine type other than the current machine. Click OK to terminate the application. ERROR_NO_RECOVERY_PROGRAM 1083 The executable program that this service is configured to run in does not implement the service. A recent hardware or software change might have installed a file that is signed incorrectly or damaged, or that might be malicious software from an unknown source.

ERROR_INVALID_LEVEL 125 The disk has no volume label. Consequently the descriptions of these codes cannot be very specific.