Home > Windows 10 > Windows Installer Error Code 1607

Windows Installer Error Code 1607

Contents

This action should be sequenced after the costing actions. 2732 Directory Manager not initialized. This error is caused by a custom action that is based on Dynamic-Link Libraries. System error [4].   1404 Could not delete key [2]. Available beginning with Windows Installer version 4.5. http://pubdimensions.com/windows-10/windows-installer-1607-error-vista.php

This is a problem with the package. Invalid Installer transform format.   2247 Database: [2] Transform stream read/write failure.   2248 Database: [2] GenerateTransform/Merge: Column type in base table does not match reference table. Go to the Search the Support Knowledge Base page and search for articles that discuss this Windows Installer error message. Contact your support personnel. https://support.microsoft.com/en-us/kb/888019

1607 Unable To Install Installshield Scripting Runtime Windows 7

Search Search for: Categories Blue Screen Of Death DLL Error Fixes Driver Downloads Driver Errors EXE Errors Game Errors General Errors General Fixes Internet Errors iOS Mac OCX Errors Product Reviews ERROR_INSTALL_PACKAGE_OPEN_FAILED1619This installation package could not be opened. This error is caused by a custom action that is based on Dynamic-Link Libraries.

Could not load table '[3]' in SQL query: [4].   2230 Database: [2]. Available beginning with Windows Installer 5.0 for Windows 7 and Windows Server 2008 R2. 1944 Could not set security for service '[3]'. Missing ')' in SQL query: [3].   2232 Database: [2]. Installshield 1607 Windows 10 The information is generally for a specific scanner model distributed by Visioneer and a designated version of software provided with the scanner.

The InstallExecuteSequence may have been authored incorrectly. 1607 Unable To Install Installshield Scripting Runtime Windows 10 This error code is returned if the user chooses not to try the installation. No path exists for entry [2] in Directory table.   2707 Target paths not created. https://support.microsoft.com/en-us/kb/888019 This documentation is archived and is not being maintained.

All rights reserved. 1607 Unable To Install Installshield Scripting Runtime Windows 8 Error: [3]   1907 Could not register font [2]. If you feel you are in need of support for a Microsoft product, please go to our technical support site at support.microsoft.com.   Error codeValueDescription ERROR_SUCCESS0The action completed successfully. ERROR_PATCH_PACKAGE_OPEN_FAILED1635This patch package could not be opened.

1607 Unable To Install Installshield Scripting Runtime Windows 10

Available beginning with Windows Installer version 4.0. https://msdn.microsoft.com/en-us/library/windows/desktop/aa376931(v=vs.85).aspx Actions that change the system must be sequenced between the InstallInitialize and InstallFinalize actions. 1607 Unable To Install Installshield Scripting Runtime Windows 7 You can learn more about what kind of cookies we use, why, and how from our Privacy Policy. 1607 Error Windows 10 Step 4 – Close other instances of Windows Installer In some cases, two instances of Windows Installer can conflict and prevent the other from accessing any neccessary files.

Configuring services is supported only on Windows Vista/Server 2008 and above. navigate to this website Error loading a type library or DLL. 1912 Could not unregister type library for file [2]. Verify that the shortcut file exists and that you can access it.   1911 Could not register type library for file [2]. ERROR_APPHELP_BLOCK1259If Windows Installer determines a product may be incompatible with the current operating system, it displays a dialog box informing the user and asking whether to try to install anyway. Installshield Error 1607 Windows 7

Extended error: network provider [5], error code [4], error description [6].   2370 Invalid CRC checksum value for [2] file.{ Its header says [3] for checksum, its computed value is [4].} SOLUTION 4: Verify that the Installer folder in the Windows directory is not set to Read-only. When trouble-shooting the DLL you may need to use one or more of the tools described in KB198038. 2739 Could not access JScript run time for custom action [2]. More about the author The installation cannot continue.   2352 Could not initialize cabinet file server.

Data access failed, out of memory.   2203 Database: [2]. Error 1607 Fsx This should solve the error, however if the error is still present, go on to next step. Verify that the specified log file location exists and is writable.

Available beginning with Windows Installer for Windows Server 2003. 1937 An error occurred during the installation of assembly '[6]'.

Loading the first available size.   2864 The control [3] on dialog [2] received a browse event, but there is no configurable directory for the present selection. For more information, see _MSIExecute Mutex. 1501 Error accessing secured data. Please rename or remove the file and click Retry, or click Cancel to exit.   1313 The volume [2] is currently unavailable. Installshield Error 1607 Windows 10 Table: [3].   2225 Database: [2].

You must complete that installation before continuing this one. Please try the request again. Contact your technical support group. http://pubdimensions.com/windows-10/windows-7-installshield-error-1607.php For more information, see Using Windows Installer and Windows Resource Protection.

Exceeded number of expressions limit of 32 in WHERE clause of SQL query: [3].   2279 Database: [2] Transform: Too many columns in base table [3].   2280 Database: [2]. Available in Windows Installer version 4.0. 1611 The setup was unable to automatically close all requested applications. GetLastError: [2].   2337 Could not close file: [3] GetLastError: [2].   2338 Could not update resource for file: [3] GetLastError: [2].   2339 Could not set file time for file: Click Start > Run Type "C:\Windows\System32\msiexec.exe /REGSERVER" Click OK.

Catalog: [2], Error: [3]. It is initialized during the costing actions (CostInitialize action, FileCost action, and CostFinalize action). It has probably been updated by other means, and can no longer be modified by this patch. MergeDatabase: A reference to the base database was passed as the reference database.   2274 Database: [2].

This error is caused by a custom action that is based on Dynamic-Link Libraries. Contact your support personnel. A script required for this install to complete could not be run. ERROR_PATCH_REMOVAL_UNSUPPORTED1646The patch package is not a removable patch package.

This error is caused by a custom action that is based on Dynamic-Link Libraries. On the Folder Properties window, make sure that the Read-only option is un-selected. This is made impossible in Windows operating system to prevent crashes of the system. A system restart may be required because the file being updated is also currently in use.

ERROR_INSTALL_LOG_FAILURE1622There was an error opening installation log file. Verify that the program to be upgraded exists on your computer and that you have the correct upgrade patch.