Home > Windows Error > Windows Error 728

Windows Error 728

In the File Name box, type a name for your backup file, such as "Crystal Reports Backup". Error: {"code":"EPIPE","errno":"EPIPE","syscall":"write"} C:\Users\camer.atom\packages\nuclide\pkg\nuclide-logging\lib\consoleAppender.js:39 [2016-09-22T07:55:28.868Z] [ERROR] nuclide - Unknown return code from Flow: undefined C:\Users\camer.atom\packages\nuclide\pkg\nuclide-logging\lib\consoleAppender.js:39 [2016-09-22T07:55:28.871Z] [ERROR] nuclide - Flow failed: flow dump-types --json C:\Users\camer\Sources\SetupWizard\src\index.js. Advanced Search Forum For Techs Only Programming And Web Design Delphi 7 Error with Crystal Reports If this is your first visit, be sure to check out the FAQ by clicking Please Note: Click the [ ] image to expand the troubleshooting instructions for each step below.

Updating this driver may allow the system to go to standby mode. ERROR_CORRUPT_SYSTEM_FILE 634 (0x27A) The system file %1 has become corrupt and has been replaced. ERROR_COMMITMENT_MINIMUM 635 (0x27B) I'm not a PC guru by any stretch, but this was a godsend. This may be insecure. When I execute require('process').env.PATH in the atom developer tools, I get the following response: "C:\Users\camer\Sources\SetupWizard\bin\;C:\Users\camer\Sources\SetupWizard\bin\..\node_modules\.bin;..." When I set a breakpoint in the asyncExecute function in pkgs/commons-node/process.js, the call to where flow http://www.solvusoft.com/en/errors/runtime-errors/sap-se/crystal-reports/728-crystal-reports-error-728/

Follow these steps: 1. The stack pointer has been left in an inconsistent state. If you have additional suggestions regarding the System Error Codes documentation, given the constraints enumerated at the top of the page, please click the link labeled "Send comments about this topic Powered by vBulletin Version 4.2.2 Copyright © 2016 vBulletin Solutions, Inc.

These steps may cause a conflict between the network settings and your Execulink connection. C:\Documents and Settings\Administrator>RegCure Pro.exe Windows Windows Crystal Reports Error 728 may caused by some of the following errors Windows Explorer ErrorsJavascript ErrorsHardware MalfunctionError Symptom include:Can not printing fileBlue ScreenIO errorShutdown problemsHttp Moe likely is that CR8 isn't installed correctly. I had CR 8 installed, but wanted to test CR9 with my application, to se if my link-program (dll + exe) could run on CR9. 2.

Consequently the descriptions of these codes cannot be very specific. Runtime Errors such as “Error 728” can be caused by a variety of factors, so it is important that you troubleshoot each of the possible causes to prevent it from recurring. For more information, see Help. ERROR_PNP_RESTART_ENUMERATION 636 (0x27C) A device was removed so enumeration must be restarted. ERROR_SYSTEM_IMAGE_BAD_SIGNATURE 637 (0x27D) {Fatal System Error} The system image %s is not https://msdn.microsoft.com/en-us/library/windows/desktop/ms681388(v=vs.85).aspx In this case information is lost, however, the filter correctly handles the exception. ERROR_BAD_FUNCTION_TABLE 559 (0x22F) A malformed function table was encountered during an unwind operation. ERROR_NO_GUID_TRANSLATION 560 (0x230)

Click on the Crystal Reports-associated entry. Error: {"code":"EPIPE","errno":"EPIPE","syscall":"write"} C:\Users\camer.atom\packages\nuclide\pkg\nuclide-logging\lib\consoleAppender.js:39 [2016-09-22T07:49:21.119Z] [ERROR] nuclide - Unknown return code from Flow: undefined C:\Users\camer.atom\packages\nuclide\pkg\nuclide-logging\lib\consoleAppender.js:39 [2016-09-22T07:49:21.119Z] [ERROR] nuclide - Flow failed: flow type-at-pos --json --path C:\Users\camer\Sources\SetupWizard\src\index.js 3 14. Local fixups must be performed on this image. ERROR_RXACT_STATE_CREATED 701 (0x2BD) This informational level status indicates that a specified registry sub-tree transaction state did not yet exist and had to Type "update" into the search box and hit ENTER.

Please Note: If 728 errors still persist after a clean install of Windows, your Runtime Errors problem MUST be hardware related. For a multi-byte character set this includes a lead byte without a succeeding trail byte. Type exit and press Enter to return to Windows. 6. Even if you are experienced at finding, downloading, and manually updating drivers, the process can still be very time consuming and extremely irritating.

So it becomes necessary to repair the damaged or corrupted files first to check for updates. at ChildProcess.exithandler (child_process.js:214:12) at emitTwo (events.js:100:13) at ChildProcess.emit (events.js:185:7) at maybeClose (internal/child_process.js:850:16) at Socket. (internal/child_process.js:323:11) at emitOne (events.js:90:13) at Socket.emit (events.js:182:7) at Pipe._onclose (net.js:477:12) After this, it does not attempt to Versions CR 8 and earlier had trouble with uninstalling. mlmcc 0 Message Author Comment by:Perherman2005-10-10 I think my problem comes from the following: 1.

System Restore can return your PC's system files and programs back to a time when everything was working fine. You will be prompted with a permission dialog box. Compatible with Windows 10, 8, 7, Vista, XP and 2000 Symptoms of Error 728 "Error 728" appears and crashes the active program window. This error may be caused by network connectivity issues.

NOTE: If the download link doesn't work you may need to Download it Directly from a Mirror Here. The requested size was %ld. ERROR_INVALID_IMAGE_HASH 577 (0x241) Windows cannot verify the digital signature for this file. Terresa Says: at 4:48 AM worked just like it said.

In the Run box, type command and click OK. 3.

sparcut commented Oct 27, 2016 Getting the same sort of errors, any solutions or progress towards? Click Add or Remove Programs. Each one can occur in one of many hundreds of locations in the system. To restore access to this installation of Windows, please upgrade this installation using a licensed distribution of this product. ERROR_ILLEGAL_DLL_RELOCATION 623 (0x26F) {Illegal System DLL Relocation} The system DLL %hs

It does this via a c… Document Imaging Document Management Adobe Acrobat Images and Photos Photos / Graphics Software Using, Creating and Modifying Styles in Microsoft Excel Video by: Bob Excel If you are an end-user that is experiencing difficulty with an application you are installing or running, contact customer support for the software that is displaying the error message. Follow the on-screen commands. ERROR_USER_PROFILE_LOAD 500 (0x1F4) User profile cannot be loaded. ERROR_ARITHMETIC_OVERFLOW 534 (0x216) Arithmetic result exceeded 32 bits. ERROR_PIPE_CONNECTED 535 (0x217) There is a process on other end of the pipe.

This error was returned by the server on which the file exists. Register Help Remember Me? DO NOT hit ENTER yet! We do not guarantee that problems resulting from the incorrect use of Registry Editor can be solved.

In the Save In list, select the folder where you want to save the Crystal Reports backup key. You may choose OK to terminate the process, or Cancel to ignore the error. ERROR_SYSTEM_PROCESS_TERMINATED 591 (0x24F) {Fatal System Error} The %hs system process terminated unexpectedly with a status of Crystal Reports), reinstall the program according to the SAP SE instructions. Crystal Reports) under the Name column.

Join our community for more solutions or to ask questions. Instructions for Windows XP: Open Programs and Features by clicking the Start button. Latest searches: update error 728, stop error 728, runtime error 728, blue screen of death error 728, bsod error 728, fix error code 728 (Fixed) Windows error code 728 Tagged on: We don't actually use the full path to the binary that we receive from it.

The system pauses for up to a minute while the TCP/IP stack is reset. Windows runs sluggishly and responds slowly to mouse or keyboard input. Sign in to comment Contact GitHub API Training Shop Blog About © 2016 GitHub, Inc. Language ▼ English Français Nederlands 日本語 Deutsch Español Italiano Português (BR) Dansk Cestina 中文 (漢語) Türkçe Русский Polski Svenska Norsk Suomi 한국말 Ελληνικά Magyar Home Software Products WinThruster DriverDoc WinSweeper SupersonicPC

The computer WAS able to connect on a secondary transport. ERROR_PAGE_FAULT_TRANSITION 747 (0x2EB) Page fault was a transition fault. ERROR_PAGE_FAULT_DEMAND_ZERO 748 (0x2EC) Page fault was a demand zero fault. Runtime Errors Knowledgebase Article ID: 122873 Article Author: Jay Geater Last Updated: 18-07-2016 Popularity: star rating here Download NowError Fix Learn More Tweet Recommendation: Scan your PC for computer errors. Privacy Policy Site Map Support Terms of Use About Us  •  Blog  •  Contact Us  •  Chat  •  Webmail Your location: Residential Internet Phone TV Mobility Business Internet Phone Hosting Support Click on the Start button to scan your computer.

Click the Uninstall button on the top menu ribbon. Windows XPhttp://www.theeldergeek.com/windows_xp_registry.htm Windows 7http://www.theeldergeek.com/windows_7/registry_edits_for_win7.htm Windows Vistahttp://support.microsoft.com/kb/2688326 - LetMeFixItMyselfAlways Step 2: Conduct a Full Malware Scan of Your PC There is a chance that your 728 error could be related to a