Home > Windows Installer > Windows Installer Error 1624

Windows Installer Error 1624

Contents

ERROR_FUNCTION_NOT_CALLED1626The function could not be executed. Like Show 0 Likes(0) Actions Go to original post Actions More Like This Retrieving data ... It's the most common error code. when you know where to look for !Search for a key containing "Adobe Acrobat 8 Professional" as ProductName (should be in HKLM\SOFTWARE\Classes\Installer\Products\68AB..)Then you get a Transforms key with the second value http://pubdimensions.com/windows-installer/windows-installer-error-code-1603-installing-windows-installer.php

Solution: Make sure you have the permissions to write to the log file. No path exists for entry [2] in Directory t... 2708: No entries found in the file table. 2709: The specified Component name ('[2]') not found in Component table. 2710: The requested ERROR_INSTALL_UI_FAILURE1621There was an error starting the Windows Installer service user interface. Failed to save table [3]. 2278: Database: [2]. click site

There Was An Error Applying Transforms. Verify That The Specified Transform Paths Are Valid.

Hope it helps. ERROR_BAD_CONFIGURATION1610The configuration data for this product is corrupt. HRESULT [3]. 1905: Module [2] failed to unregister.

ERROR_UNKNOWN_PATCH1647The patch is not applied to this product. Legal | Feedback 073948d Tue November 1 14:24:35 EDT 2016"www.itninja.com Log in Sign up! This does not include installs where the ForceReboot action is run.       Show: Inherited Protected Print Export (0) Print Export (0) Share IN THIS ARTICLE Is this page helpful? Windows Installer Cleanup Utility Can it be exploited by blockchain analysis?

ERROR_INVALID_FIELD1616The record field does not exist. Msi Error 1619 ERROR_FUNCTION_FAILED1627The function failed during execution. The keys that cause the non-existent transform to run are: HKEY_CLASSES_ROOT\Installer\Products\ HKEY_LOCAL_MACHINE\SOFTWARE\Microsoft\Windows\CurrentVersion\Group Policy\AppMgmt\{} I'm thinking deleting these (if they exist) on uninstall would guarantee that the next install will succeed. my response Nothing to be done 13 ERROR_INVALID_DATA The data is invalid 87 ERROR_INVALID_PARAMETER One of the parameters was invalid. 1601 ERROR_INSTALL_SERVICE_FAILURE The Windows Installer service could not be accessed.

This content is currently hidden from public view. Orca To... 1703: For the configuration changes made to [2] to take effect you must res... 1704: An install for [2] is currently suspended. Answers 1 If the transform is is called from the network, check that access to the drive is always accessible. called out of sequence. 2903: The file [2] is missing. 2904: Could not BindImage file [2]. 2905: Could not read record from script file [2]. 2906: Missing header in script file

Msi Error 1619

Contact your system administrator. 1626 ERROR_FUNCTION_NOT_CALLED Function could not be executed. 1627 ERROR_FUNCTION_FAILED Function failed during execution. 1628 ERROR_INVALID_TABLE Invalid or unknown table specified. 1629 ERROR_DATATYPE_MISMATCH Data supplied is of wrong http://www.itninja.com/question/what-does-this-msi-error-mean Though, I was hoping that I'd find a better answer than this. There Was An Error Applying Transforms. Verify That The Specified Transform Paths Are Valid. You must install a Windows service pack that contains a newer version of the Windows Installer service. Error 1624 Error Applying Transforms Cannot open database file.

GetLastError: [2]. 2333: Error setting file attributes. navigate to this website Cursor in invalid state. 2210: Database: [2]. Error: '[2]'. 2609: Attempt to migrate product settings before initialization. 2611: "The file [2] is marked as compressed, but the associated media entry... 2612: Stream not found in '[2]' column. Verify that y... 1927: The installation requires COM+ Services to be installed. 1928: The installation failed to install the COM+ Application. 1929: The installation failed to remove the COM+ Application. 1930: Msi 1603

Average Rating 5 100352 views 07/26/2006 Windows Installer (MSI) Windows Installer (MSI) Error Messages Troubleshooting appdeploy-faqs Microsoft Windows Installer The errors returned by the Windows Installer service are unique to MSI System error [4]. 1404: Could not delete key [2]. System error: [2]. 2107: Error [3] registering type library [2]. 2108: Error [3] unregistering type library [2]. 2109: Section missing for .ini action. 2110: Key missing for .ini action. 2111: Detection http://pubdimensions.com/windows-installer/windows-installer-xp-error.php Contact your support personnel.

Answered 01/23/2004 by: AppDeploy.com Please log in to comment Please log in to comment 1 Issue can be that the transform is marked Windows Installer 3.n only (in my example, Schema Is there any way to bring an egg to its natural state (not boiled) after you cook it? Verify that the specified log file location exists and is writable.

ERROR_UNKNOWN_COMPONENT1607The component identifier is not registered.

Try to install Windows installer 3.1 on the PC ( WindowsInstaller-KB893803-v2-x86.exe ) and re-try. Verify that the source exists and that you can access it. 1613 ERROR_INSTALL_PACKAGE_VERSION This installation package cannot be installed by the Windows Installer service. You must undo the changes ... 1705: A previous install for this product is in progress. Available beginning with Windows Installer version 3.0.

Missing ')' in SQL query: [3]. 2232: Database: [2]. Show 8 replies 1. In bold, you`ll find the ones you'll encounter the most. click site More info here 1621 ERROR_INSTALL_UI_FAILURE There was an error starting the Windows Installer service user interface.

Any ideas on how to fix this problem or what is going on? GetLastError: [2]. 2304: Error getting disk free space. Transaction not started. 2763: Cannot run script. Verify that the specified transform paths are valid.

Note that any error in Winerror.h (such as ERROR_INVALID_DATA, included here) can be returned as well. ERROR_SUCCESS_REBOOT_REQUIRED3010A restart is required to complete the install. What's in Naboo's core, liquid water or plasma? Troubleshooting Lotus Notes Deploying Images from USB devices with the KACE 2000 Demystifying CPU Ready (%RDY) as a Performance Metric Issue with @RISK Industrial 5.7.1 4.11.2012- the week so far ICE

Expected upgrade code [4], fo... 2761: Cannot begin transaction. Toggle navigation Software Tips Questions Blogs Links Communities Questions & Answers What do the various Windows Installer (MSI) error codes mean? Contact your technic... 1714: The older version of [2] cannot be removed. System error [4]. 1406: Could not write value [2] to key [3].

ERROR_INVALID_PATCH_XML1650The XML patch data is invalid. Verify that you have suffic... 1923: Service '[2]' ([3]) could not be installed. System error: [3]. 2268: Database: [2]. Expected product version < [4... 2748: "Transform [2] invalid for package [3].

No transform generated. 2224: Database: [2]. ERROR_INSTALL_FAILURE1603A fatal error occurred during installation. Table already exists: [3]. 2205: Database: [2]. Please type your message and try again.

English fellow vs Arabic fellah Achieve same random number sequence on different OS with same seed Output a googol copies of a string Are basis vectors imaginary in special relativity?