Home > Windows Installer > Windows Installer Error Code 1641

Windows Installer Error Code 1641

Contents

Contact your supp... 1611: The component qualifier not present. 1612: The installation source for this product is not available. Is there any way to bring an egg to its natural state (not boiled) after you cook it? A program run... 1723: There is a problem with this Windows Installer package. The system will be restarted sothe changes can take effect.C:\Users\Ryan>net helpmsg 3010The requested operation is successful. http://pubdimensions.com/windows-installer/windows-installer-error-code-1603-installing-windows-installer.php

Troubleshooting Lotus Notes Deploying Images from USB devices with the KACE 2000 Demystifying CPU Ready (%RDY) as a Performance Metric Issue with @RISK Industrial 5.7.1 4.11.2012- the week so far ICE MergeDatabase will not write any changes because the d... 2273: Database: [2]. This happens when you try to uninstall/repair an MSI using its product code. This does not include installs where the ForceReboot action is run. https://msdn.microsoft.com/en-us/library/windows/desktop/aa376931(v=vs.85).aspx

Msi Error Code 1603

Import file format error: [3], Line [4]. 2217: Database: [2]. ERROR_CALL_NOT_IMPLEMENTED 1259 This error code only occurs when using Windows Installer version 2.0 and Windows XP or later. Code page conflict in import file: [3]. 2222: Database: [2]. called out of sequence. 2903: The file [2] is missing. 2904: Could not BindImage file [2]. 2905: Could not read record from script file [2]. 2906: Missing header in script file

Error: [2]. Browse other questions tagged windows-installer or ask your own question. Nothing to be done 13 ERROR_INVALID_DATA The data is invalid 87 ERROR_INVALID_PARAMETER One of the parameters was invalid. 1601 ERROR_INSTALL_SERVICE_FAILURE The Windows Installer service could not be accessed. Psexec Error Code 1619 Primary key: '[3]'. 2613: RemoveExistingProducts action sequenced incorrectly. 2614: Could not access IStorage object from installation package. 2615: Skipped unregistration of Module [2] due to source resolution failure. 2616: Companion file

Verify that the specified transform paths are valid. Msi Motherboard Error Codes ERROR_INSTALL_UI_FAILURE 1622 Error opening installation log file. ERROR_INDEX_ABSENT 1612 The installation source for this product is not available. https://www.symantec.com/connect/articles/windows-installer-exit-error-codes-log-files A directory with this name already exis... 1302: Please insert the disk: [2] 1303: The Installer has insufficient privileges to access this directory: ... 1304: Error writing to File: [2] 1305:

Verify that you have sufficient permis... 1909: Could not create shortcut [2]. Msi Error 1619 Windows 7 Why was Vader surprised that Obi-Wan's body disappeared? Toggle navigation Software Tips Questions Blogs Links Communities Questions & Answers Help with MSI 1641 Help with MSI 1641 AppDeploy.com How helpful is this to you? ERROR_FUNCTION_NOT_CALLED 1627 Function failed during execution.

Msi Motherboard Error Codes

Invalid Installer database format. 2220: Database: [2]. http://www.itninja.com/question/help-with-msi-1641 This error code is not available on Windows Installer version 1.0. Msi Error Code 1603 Use of this site signifies your acceptance of BMC's Terms of Use, Privacy Policy and Cookie Notice.BMC, BMC Software, the BMC logos, and other BMC marks are trademarks or registered trademarks Windows Installer Returned 1613 Vmware Verify that the patch package exists and that you can access it, or contact the application vendor to verify that this is a valid Windows Installer patch package.

Please type your message and try again. navigate to this website System error [3]. 1403: Could not delete value [2] from key [3]. Re: MSI package returns a non-zero exit code (when it really succeeds) and therefore causes the Bladelogic job to show up as failed Jim Campbell Aug 2, 2013 9:17 AM (in Consult the Windows Installer SDK for detailed command line help. Windows Installer Returned 1639

ERROR_PRODUCT_VERSION 1639 Invalid command line argument. ERROR_INSTALL_PLATFORM_UNSUPPORTED 1634 Component not used on this machine ERROR_INSTALL_NOTUSED 1635 This patch package could not be opened. Re: MSI package returns a non-zero exit code (when it really succeeds) and therefore causes the Bladelogic job to show up as failed Siddu angadi Aug 14, 2013 4:54 AM (in http://pubdimensions.com/windows-installer/windows-installer-error-code-5.php Sign up!

Verify that the source exists and that you can access it. 1613 ERROR_INSTALL_PACKAGE_VERSION This installation package cannot be installed by the Windows Installer service. Windows Installer Error 1605 Outlook 2010 Please, insert one and click Retry, or... 1805: The path [2] does not exist 1806: You have insufficient privileges to read this folder. 1807: A valid destination folder for the install System error [3]. 1410: Could not increase the available registry space. [2] KB of free regis... 1500: Another installation is in progress.

The ProductCode can normally be used within the remove command for an MSI.

ERROR_CALL_NOT_IMPLEMENTED 1259 This error code only occurs when using Windows Installer version 2.0 and Windows XP or later. What do the various Windows Installer (MSI) error codes mean? System error [3]. 2204: Database: [2]. There Was An Error Applying Transforms. Verify That The Specified Transform Paths Are Valid. Contact your system administrator.

GetLastError:... 2335: Path: [2] is not a parent of [3]. 2336: Error creating temp file on path: [3]. How do I specify files to not be removed during uninstall? ERROR_INSTALL_TRANSFORM_FAILURE 1625 This installation is forbidden by system policy. click site more stack exchange communities company blog Stack Exchange Inbox Reputation and Badges sign up log in tour help Tour Start here for a quick overview of the site Help Center Detailed

Merge: There were merge conflicts reported in [3] tabl... 2269: Database: [2]. ERROR_INVALID_FIELD 1618 Another installation is already in progress. ERROR_INSTALL_REMOTE_DISALLOWEDd 1641 The installer has started a reboot. A program req... 1722: There is a problem with this Windows Installer package.

Consult the Windows Installer SDK for detailed command line help. 1640 ERROR_INSTALL_REMOTE_DISALLOWED Installation from a Terminal Server client session not permitted for current user. 1641 ERROR_SUCCESS_REBOOT_INITIATED The installer has started a ERROR_PATCH_PACKAGE_OPEN_FAILED 1636 This patch package could not be opened. Or change its location. 1623 ERROR_INSTALL_LANGUAGE_UNSUPPORTED This language of this installation package is not supported by your system. 1624 ERROR_INSTALL_TRANSFORM_FAILURE Error applying transforms.