Home > Windows Installer > Windows Installer Installation Wrapper Error 1642

Windows Installer Installation Wrapper Error 1642

Contents

Merge: The column count differed in the '[3]' table of... 2270: Database: [2]. I... 1308: Source file not found: [2] 1309: Error attempting to open the source file: [3]. Multiple-Package Installations cannot run if rollback is disabled. Verify tha... 1613: This installation package cannot be installed by the Windows Installe... 1614: The product is uninstalled. 1615: The SQL query syntax is invalid or unsupported. 1616: The record field http://pubdimensions.com/windows-installer/windows-installer-error-1642.php

HRESULT [3]. 1905: Module [2] failed to unregister. Note that any error in Winerror.h (such as ERROR_INVALID_DATA, included here) can be returned as well. Verify that the shortcut file exists a... 1911: Could not register type library for file [2]. Column '[3]' repeated. 2243: Database: [2]. http://forums.guru3d.com/showthread.php?t=299764

Msi Error Code 1603

Contact your support pe... 1912: Could not unregister type library for file [2]. Your suggestion of extracting to a different folder worked for me. And make sure the DVD is in the drive, like you were playing the game.. Prajwal Desai, Feb 9, 2016 #7 (You must log in or sign up to reply here.) Show Ignored Content Loading...

System error [4]. 1407: Could not get value names for key [2]. System error [4]. 1404: Could not delete key [2]. No transform generated. 2224: Database: [2]. Windows Installer Error 1619 I tried many ways of fixing the issue with no luck until I read the above post regarding the Direct2Drive.

Table already exists: [3]. 2205: Database: [2]. Windows Installer Error Codes Cursor in invalid state. 2210: Database: [2]. Downloads and tools Windows 10 dev tools Visual Studio Windows SDK Windows Store badges Essentials API reference (Windows apps) API reference (desktop apps) Code samples How-to guides (Windows apps) Learning resources Thank you so much Olaf!!

Error: [3] 1907: Could not register font [2]. Windows Installer Returned 1613 Vmware bkelly How helpful is this to you? Contact your support personnel to verify that the Windows Installer service is properly registered. EDIT: I just realised mine are in fact the same size as yours, the actual size on disk is 361mb but it shows how ever many kb it was before.

Windows Installer Error Codes

System error [3]. 1410: Could not increase the available registry space. [2] KB of free regis... 1500: Another installation is in progress. The problem is harder than that! Msi Error Code 1603 System error: [3]. 2267: Could not delete storage [2]. Msi Error Codes Check the first window after Crysis is launched.

Insufficient values in INSERT SQL statement. 2240: Database: [2]. http://pubdimensions.com/windows-installer/windows-installer-returned-error-1642.php Marking this thread as Solved. but ensure you have Reg Backups... ERROR_CALL_NOT_IMPLEMENTED120This value is returned when a custom action attempts to call a function that cannot be called from custom actions. Msi Motherboard Error Codes

ERROR_INSTALL_REMOTE_DISALLOWED1640The current user is not permitted to perform installations from a client session of a server running the Terminal Server role service. Check the Outlook / Office Bit (my Client had 32-Bit Office) a. Please log in to comment Rating comments in this legacy AppDeploy message board thread won't reorder them,so that the conversation will remain readable. More about the author GameFAQs.comfacebook.com/GFAQstwitter.com/GameFAQsHelp / Contact UsChange Colors Blue (Default)Blue on BlackRedRed on BlackGreenGreen on BlackOrangeOrange on BlackPurplePurple on BlackCloudy BlueGrayscaleSepiaCotton Candygamespot.comgiantbomb.commetacritic.comgamerankings.com© 2016 CBS Interactive Inc.

This message is indica... Windows Installer Returned 1639 While extracting the CRM 2015 outlook client installation file, choose different location then default location and it should work. ERROR_INSTALL_SERVICE_FAILURE1601The Windows Installer service could not be accessed.

ERROR_INSTALL_UI_FAILURE1621There was an error starting the Windows Installer service user interface.

Expected product [4], found p... 2747: "Transform [2] invalid for package [3]. Script version: [3], minimum version... 2927: ShellFolder id [2] is invalid. 2928: Exceeded maximum number of sources. MergeDatabase: A reference to the base database was pa... 2274: Database: [2]. This Installation Is Forbidden By System Policy. Contact Your System Administrator. Invalid Installer transform format. 2247: Database: [2] Transform stream read/write failure. 2248: Database: [2] GenerateTransform/Merge: Column type in base table does... 2249: Database: [2] GenerateTransform: More columns in base table than

Now edit the TEMP and TMP variables. 7. Sign up for free! Supersnake View Public Profile Find all posts by Supersnake (#10) OnePostOnly Newbie Videocard: 500MB whatever Processor: Intel Core Duo Mainboard: Memory: Soundcard: PSU: 'bout three fiddy 04-23-2011, 18:33 | click site Stay logged in Community Forums Home Forums > System Center > System Center Configuration Manager > Home Forums Forums Quick Links Recent Posts Menu Style Default Style Contact Us Help Home

Available beginning with Windows Installer version 3.0. Please, insert one and click Retry, or... 1805: The path [2] does not exist 1806: You have insufficient privileges to read this folder. 1807: A valid destination folder for the install Expected product version < [4... 2748: "Transform [2] invalid for package [3]. Table: '[2]'; Primary key: '[3]'; Column: '[4]' 2731: Selection Manager not initialized 2732: Directory Manager not initialized. 2733: Bad foreign key ('[2]') in '[3]' column of the '[4]' table. 2734: Invalid

Verify that the packag... 1620: This installation package could not be opened. Please, insert one and click Retry, or... 1804: There is no disk in drive [2]. ERROR_INVALID_TABLE1628An invalid or unknown table was specified. If you can, please close the application th... 1307: There is not enough disk space remaining to install this file: [2].

This is ... 2879: The control [3] on dialog [2] cannot parse the mask string: [4]. 2880: Do not perform the remaining control events. 2881: CMsiHandler initialization failed. 2882: Dialog window TheGr81 View Public Profile Find all posts by TheGr81 (#2) Cybermancer Don Quixote Videocard: BFG GTX260OC (192 SP) Processor: Intel E8400 @ 3.6 GHz Mainboard: XFX 680i Attempting to patc... 2373: File [2] is not a valid patch file. 2374: File [2] is not a valid destination file for patch file [3]. 2375: Unknown patching error: [2]. 2376: Tags: error 1642 sccm 2012 r2 Thread Status: Not open for further replies.

Transform failed. 2227: Database: [2]. A file with this name already exis... 1313: The volume [2] is currently unavailable. Kamakshi Parate Microsoft Dynamics™ CRM Support Engineer Reply Vineet Nair My Badges Vineet Nair responded on 8 Feb 2015 2:17 PM Hi Ken, I would first advise you to download the Change the paths to c:\Temp. 8.

Expected product version >= [... 2751: "Transform [2] invalid for package [3]. And why should I not add to the thread? Tags: Dynamics CRM client Outlook 2015 Reply Ken43708new My Badges Ken43708new responded on 14 Feb 2015 11:48 AM Hello Vineet - Thank you for proposing a solution. Global mutex not properly initialized. 2762: Cannot write script record.

Help please?