Home > Windows Installer > Windows Installer Returned Error Code 1605

Windows Installer Returned Error Code 1605

Contents

Available beginning with Windows Installer version 3.0. Fatal error during installation.   [80070643] ERROR 2013/06/18 10:58:14:551 TID:2060 PID:2412 Operation failed: Setup - .  0x80070643. Contact your support personnel. 1611 ERROR_INDEX_ABSENT Component qualifier not present. 1612 ERROR_INSTALL_SOURCE_ABSENT The installation source for this product is not available. More info here. 1619 ERROR_INSTALL_PACKAGE_OPEN_FAILED This installation package could not be opened. news

you are genius . . Thanks alot Latest News ICYMI: Windows 10 Mobile for Outsiders, New Preview Build 14291 for PC and Mobile, Edge Extensions March 20, 2016Windows 10 Mobile OTA Update begins with T-Mobile Lumia Available beginning with Windows Installer version 3.0. System error code: [2] ... https://msdn.microsoft.com/en-us/library/windows/desktop/aa376931(v=vs.85).aspx

Msi Error Code 1603

Permalink 0 Tmoseley November 07, 2014 18:52 "Package returned error code -2147467259"   I was trying to deploy a ninite.exe /silent Just trying to stream line a little further.  Permalink 0 it really solved similar problem of me.. ERROR_PATCH_PACKAGE_OPEN_FAILED1635This patch package could not be opened. Thank you Ady Thank you very much!!

Sign up! ERROR_INVALID_PATCH_XML1650The XML patch data is invalid. Thanks. Windows Installer Error 1619 ERROR_INSTALL_TEMP_UNWRITABLE1632The Temp folder is either full or inaccessible.

thnx Permalink 0 Tyler McConaughey December 23, 2013 14:58 Hi, I received error code 2 while trying to deploy Webroot SecureAnywhere ver. 8.0.4.42 in a windows 7 pro environment. Contact your support personnel to verify that the Windows Installer service is properly registered. ERROR_PATCH_PACKAGE_OPEN_FAILED 1636 This patch package could not be opened. Developer resources Microsoft developer Windows Windows Dev Center Windows apps Desktop Internet of Things Games Holographic Microsoft Edge Hardware Azure Azure Web apps Mobile apps API apps Service fabric Visual Studio

Everything went fine except Visual Studio 2010 RTM Setup that logged the error in log file. [04/13/10,10:00:09] Microsoft SQL Server 2008 Express Service Pack 1 (x64): [2] Error code 2064843076 for Windows Installer Returned 1613 Vmware Contact your application vendor. 1634 ERROR_INSTALL_NOTUSED Component not used on this computer. 1635 ERROR_PATCH_PACKAGE_OPEN_FAILED This patch package could not be opened. can anyone suggest a way to skip these processes only if they are installed and still run the other program as im stumped with this? Installation of this version cannot continue.

Msi Error Codes

MSI Internal Error Codes - kc.mcafee.com MSI Internal Error Codes ... Go Here ERROR_INVALID_FIELD1616The record field does not exist. Msi Error Code 1603 close × Related Documents ASKIVER Contact Us What is Askiver? Windows Installer Error Codes ERROR_INSTALL_SERVICE_FAILURE1601The Windows Installer service could not be accessed.

This can be easily done in batch or vbscript. navigate to this website Available beginning with Windows Installer version 3.0. I had clean about 5 times. Ramesh Kumar Thanks for your comments and appreciation! Msi Motherboard Error Codes

This message is indicative of a success. ERROR_INSTALL_FAILURE 1604 Installation suspended, incomplete. Contact your support personnel. More about the author The 64 bit machines push just fine but the 32 bit machines keep failing with an Error Code 40004.

Verify that the specified transform paths are valid. Windows Installer Returned 1639 ERROR_INVALID_PARAMETER 120 This function is only available for Win 2000 and Windows XP with Windows Installer v2.0. ERROR_INSTALL_SUSPEND1604Installation suspended, incomplete.

Verify that the program to be upgraded exists on your computer and that you have the correct upgrade patch. 3010 ERROR_SUCCESS_REBOOT_REQUIRED A restart is required to complete the install.

Angela You are awesome! This does not include installs where the ForceReboot action is run.       Show: Inherited Protected Print Export (0) Print Export (0) Share IN THIS ARTICLE Is this page helpful? Available beginning with Windows Installer version 3.0. Windows Installer Error 1605 Outlook 2010 ERROR_INSTALL_ALREADY_RUNNING1618Another installation is already in progress.

Complete that installation before proceeding with this install.For information about the mutex, see _MSIExecute Mutex. Meaning that the ALLUSERS property may not be set correctly. Verify that the temp folder exists and that you can write to it. click site Yes No Additional feedback? 1500 characters remaining Submit Skip this Thank you!

To configure or remove the existing version of this product, use Add/Remove Programs on the Control Panel. ERROR_INSTALL_TEMP_UNWRITABLE 1633 This installation package is not supported on this platform. Sign up today to participate, stay informed, earn points and establish a reputation for yourself!